Target
Receptor-interacting serine/threonine-protein kinase 1
Ligand
BDBM50446274
Substrate
Meas. Tech.
ChEMBL_1288031 (CHEMBL3110730)
IC50
32±n/a nM
Citation
 Harris, PABandyopadhyay, DBerger, SBCampobasso, NCapriotti, CACox, JADare, LFinger, JNHoffman, SJKahler, KMLehr, RLich, JDNagilla, RNolte, RTOuellette, MTPao, CSSchaeffer, MCSmallwood, ASun, HHSwift, BATotoritis, RDWard, PMarquis, RWBertin, JGough, PJ Discovery of Small Molecule RIP1 Kinase Inhibitors for the Treatment of Pathologies Associated with Necroptosis. ACS Med Chem Lett 4:1238-43 (2013)  
Target
Name:
Receptor-interacting serine/threonine-protein kinase 1
Synonyms:
Cell death protein RIP RIP-1 RIPK1 Receptor-interacting protein 1
Type:
Enzyme Catalytic Domain
Mol. Mass.:
75926.99
Organism:
Homo sapiens (Human)
Description:
Q13546
Residue:
671
  
Inhibitor
Name:
BDBM50446274
Synonyms:
CHEMBL3109205
Type:
Small organic molecule
Emp. Form.:
C27H22N4O2
Mol. Mass.:
434.4892
SMILES:
COc1cccc(NC(=O)Nc2cccc(c2)-c2c[nH]c3ncc(cc23)-c2ccccc2)c1
: