Target
Aurora kinase B
Ligand
BDBM50446436
Substrate
Meas. Tech.
ChEMBL_1287773 (CHEMBL3111605)
IC50
4500±n/a nM
Citation
 Naud, SWestwood, IMFaisal, ASheldrake, PBavetsias, VAtrash, BCheung, KMLiu, MHayes, ASchmitt, JWood, AChoi, VBoxall, KMak, GGurden, MValenti, Mde Haven Brandon, AHenley, ABaker, RMcAndrew, CMatijssen, BBurke, RHoelder, SEccles, SARaynaud, FILinardopoulos, Svan Montfort, RLBlagg, J Structure-based design of orally bioavailable 1H-pyrrolo[3,2-c]pyridine inhibitors of mitotic kinase monopolar spindle 1 (MPS1). J Med Chem 56:10045-65 (2013)  
Target
Name:
Aurora kinase B
Synonyms:
AIK2 AIM1 ARK2 AURKB_HUMAN Aurora B-INCENP Aurora kinase B (AURKB) STK-1 STK12 Serine/threonine-protein kinase aurora B
Type:
Protein
Mol. Mass.:
39327.72
Organism:
Homo sapiens (Human)
Description:
Q96GD4
Residue:
344
  
Inhibitor
Name:
BDBM50446436
Synonyms:
CHEMBL3109952
Type:
Small organic molecule
Emp. Form.:
C22H24N6O2
Mol. Mass.:
404.465
SMILES:
C(CN1CCOCC1)Oc1ccc(Nc2cc3[nH]c(cc3cn2)-c2cn[nH]c2)cc1
: