Target
Dual specificity protein kinase TTK
Ligand
BDBM50446442
Substrate
Meas. Tech.
ChEMBL_1287775 (CHEMBL3111607)
IC50
16±n/a nM
Citation
 Naud, SWestwood, IMFaisal, ASheldrake, PBavetsias, VAtrash, BCheung, KMLiu, MHayes, ASchmitt, JWood, AChoi, VBoxall, KMak, GGurden, MValenti, Mde Haven Brandon, AHenley, ABaker, RMcAndrew, CMatijssen, BBurke, RHoelder, SEccles, SARaynaud, FILinardopoulos, Svan Montfort, RLBlagg, J Structure-based design of orally bioavailable 1H-pyrrolo[3,2-c]pyridine inhibitors of mitotic kinase monopolar spindle 1 (MPS1). J Med Chem 56:10045-65 (2013)  
Target
Name:
Dual specificity protein kinase TTK
Synonyms:
Dual specificity protein kinase (TTK) MPS1 Monopolar Spindle 1 (MPS1) Monopolar Spindle 1 Kinase (MPS1) TTK | TTK_HUMAN
Type:
Protein
Mol. Mass.:
97086.79
Organism:
Homo sapiens (Human)
Description:
P33981
Residue:
857
  
Inhibitor
Name:
BDBM50446442
Synonyms:
CHEMBL3109950
Type:
Small organic molecule
Emp. Form.:
C18H18N6O2S
Mol. Mass.:
382.44
SMILES:
CN(C)S(=O)(=O)c1ccc(Nc2cc3[nH]c(cc3cn2)-c2cn[nH]c2)cc1
: