Target
Dual specificity protein kinase TTK
Ligand
BDBM50446428
Substrate
Meas. Tech.
ChEMBL_1287775 (CHEMBL3111607)
IC50
5.0±n/a nM
Citation
 Naud, SWestwood, IMFaisal, ASheldrake, PBavetsias, VAtrash, BCheung, KMLiu, MHayes, ASchmitt, JWood, AChoi, VBoxall, KMak, GGurden, MValenti, Mde Haven Brandon, AHenley, ABaker, RMcAndrew, CMatijssen, BBurke, RHoelder, SEccles, SARaynaud, FILinardopoulos, Svan Montfort, RLBlagg, J Structure-based design of orally bioavailable 1H-pyrrolo[3,2-c]pyridine inhibitors of mitotic kinase monopolar spindle 1 (MPS1). J Med Chem 56:10045-65 (2013)  
Target
Name:
Dual specificity protein kinase TTK
Synonyms:
Dual specificity protein kinase (TTK) MPS1 Monopolar Spindle 1 (MPS1) Monopolar Spindle 1 Kinase (MPS1) TTK | TTK_HUMAN
Type:
Protein
Mol. Mass.:
97086.79
Organism:
Homo sapiens (Human)
Description:
P33981
Residue:
857
  
Inhibitor
Name:
BDBM50446428
Synonyms:
CHEMBL3109939
Type:
Small organic molecule
Emp. Form.:
C27H29ClN6O5S
Mol. Mass.:
585.074
SMILES:
Cn1cc(cn1)-c1cc2cnc(Nc3ccc(cc3Cl)C(=O)N3CCS(=O)(=O)CC3)cc2n1C(=O)OC(C)(C)C
: