Target
Arginase
Ligand
BDBM15236
Substrate
Meas. Tech.
ChEMBL_1286564 (CHEMBL3110797)
Ki
1200±n/a nM
Citation
 de Sousa, LRRamalho, SDBurger, MCNebo, LFernandes, JBda Silva, MFIemma, MRCorrêa, CJde Souza, DHLima, MIVieira, PC Isolation of arginase inhibitors from the bioactivity-guided fractionation of Byrsonima coccolobifolia leaves and stems. J Nat Prod 77:392-6 (2014)  
Target
Name:
Arginase
Synonyms:
Type:
PROTEIN
Mol. Mass.:
36149.67
Organism:
Leishmania amazonensis
Description:
ChEMBL_107995
Residue:
329
  
Inhibitor
Name:
BDBM15236
Synonyms:
3,5,7-trihydroxy-2-(3,4,5-trihydroxyphenyl)-4H-chromen-4-one CHEMBL164 Myricetin Myricetin (Myr) | cid_5281672
Type:
Small organic molecule
Emp. Form.:
C15H10O8
Mol. Mass.:
318.2351
SMILES:
Oc1cc(O)c2c(c1)oc(-c1cc(O)c(O)c(O)c1)c(O)c2=O
: