Target
Arginase
Ligand
BDBM84978
Substrate
Meas. Tech.
ChEMBL_1286565 (CHEMBL3110798)
IC50
12200±n/a nM
Citation
 de Sousa, LRRamalho, SDBurger, MCNebo, LFernandes, JBda Silva, MFIemma, MRCorrêa, CJde Souza, DHLima, MIVieira, PC Isolation of arginase inhibitors from the bioactivity-guided fractionation of Byrsonima coccolobifolia leaves and stems. J Nat Prod 77:392-6 (2014)  
Target
Name:
Arginase
Synonyms:
Type:
PROTEIN
Mol. Mass.:
36149.67
Organism:
Leishmania amazonensis
Description:
ChEMBL_107995
Residue:
329
  
Inhibitor
Name:
BDBM84978
Synonyms:
Quercitrin | cid_5280459
Type:
Small organic molecule
Emp. Form.:
C21H20O11
Mol. Mass.:
448.3769
SMILES:
C[C@@H]1O[C@@H](Oc2c(O)c3c(cc(O)cc3=O)oc2-c2ccc(O)c(O)c2)[C@H](O)[C@H](O)[C@H]1O
: