Target
Polyunsaturated fatty acid 5-lipoxygenase
Ligand
BDBM50446684
Substrate
Meas. Tech.
ChEMBL_1290921 (CHEMBL3118894)
Ki
4160±n/a nM
Citation
 Prasher, PPooja, naSingh, P Lead modification: amino acid appended indoles as highly effective 5-LOX inhibitors. Bioorg Med Chem 22:1642-8 (2014)  
Target
Name:
Polyunsaturated fatty acid 5-lipoxygenase
Synonyms:
5-LO 5-Lipoxygenase (5-LO) 5-Lipoygenase ALOX5 LOG5 | LOX5_HUMAN
Type:
Enzyme
Mol. Mass.:
77972.74
Organism:
Homo sapiens (Human)
Description:
Recombinant protein was purified from E. coli lysate. After ammonium sulfate precipitation and subsequent steps, the supernatant (S100) was used for 5-LO activity assay.
Residue:
674
  
Inhibitor
Name:
BDBM50446684
Synonyms:
CHEMBL3113614
Type:
Small organic molecule
Emp. Form.:
C24H22N4O6S
Mol. Mass.:
494.52
SMILES:
COC(=O)[C@@H](Cc1cnc[nH]1)NC(=O)C(=O)c1cn(c2ccccc12)S(=O)(=O)c1ccc(C)cc1
: