Target
Hexokinase-4
Ligand
BDBM50447285
Substrate
Meas. Tech.
ChEMBL_1291251 (CHEMBL3117036)
IC50
524±n/a nM
Citation
 St Jean, DJAshton, KSBartberger, MDChen, JChmait, SCupples, RGalbreath, EHelmering, JHong, FTJordan, SRLiu, LKunz, RKMichelsen, KNishimura, NPennington, LDPoon, SFReid, DSivits, GStec, MMTadesse, STamayo, NVan, GYang, KCZhang, JNorman, MHFotsch, CLloyd, DJHale, C Small molecule disruptors of the glucokinase-glucokinase regulatory protein interaction: 2. Leveraging structure-based drug design to identify analogues with improved pharmacokinetic profiles. J Med Chem 57:325-38 (2014)  
Target
Name:
Hexokinase-4
Synonyms:
GCK Glucokinase (GK) HK IV HXK4_HUMAN Hexokinase-D
Type:
Enzyme
Mol. Mass.:
52175.81
Organism:
Homo sapiens (Human)
Description:
P35557
Residue:
465
  
Inhibitor
Name:
BDBM50447285
Synonyms:
CHEMBL3113984
Type:
Small organic molecule
Emp. Form.:
C23H28F3N3O4S2
Mol. Mass.:
531.611
SMILES:
CC(O)(c1ccc(cc1)N1CCN(C[C@@H]1CN1CC2(COC2)C1)S(=O)(=O)c1cccs1)C(F)(F)F
: