Target
Cytochrome P450 2C9
Ligand
BDBM50447388
Substrate
Meas. Tech.
ChEMBL_1291567 (CHEMBL3118923)
IC50
>25000±n/a nM
Citation
 Liu, HXu, LHui, HVivian, RCallebaut, CMurray, BPHong, ALee, MSTsai, LKChau, JKStray, KMCannizzaro, CChoi, YCRhodes, GRDesai, MC Structure-activity relationships of diamine inhibitors of cytochrome P450 (CYP) 3A as novel pharmacoenhancers, part I: core region. Bioorg Med Chem Lett 24:989-94 (2014)  
Target
Name:
Cytochrome P450 2C9
Synonyms:
(R)-limonene 6-monooxygenase CP2C9_HUMAN CYP2C9 Cytochrome P450 2C9 (CYP2C9 ) P-450MP P450 PB-1 | S-mephenytoin 4-hydroxylase
Type:
Enzyme
Mol. Mass.:
55636.33
Organism:
Homo sapiens (Human)
Description:
P11712
Residue:
490
  
Inhibitor
Name:
BDBM50447388
Synonyms:
CHEMBL3114738
Type:
Small organic molecule
Emp. Form.:
C35H44N6O4S2
Mol. Mass.:
676.892
SMILES:
CC(C)[C@H](NC(=O)N(C)Cc1csc(n1)C(C)C)C(=O)N[C@@H](Cc1ccccc1)[C@H](Cc1ccccc1)NC(=O)OCc1cncs1
: