Target
Cytochrome P450 2C9
Ligand
BDBM50447472
Substrate
Meas. Tech.
ChEMBL_1288287 (CHEMBL3117570)
IC50
>25000±n/a nM
Citation
 Xu, LLiu, HHong, AVivian, RMurray, BPCallebaut, CChoi, YCLee, MSChau, JTsai, LKStray, KMStrickley, RGWang, JTong, LSwaminathan, SRhodes, GRDesai, MC Structure-activity relationships of diamine inhibitors of cytochrome P450 (CYP) 3A as novel pharmacoenhancers. Part II: P2/P3 region and discovery of cobicistat (GS-9350). Bioorg Med Chem Lett 24:995-9 (2014)  
Target
Name:
Cytochrome P450 2C9
Synonyms:
(R)-limonene 6-monooxygenase CP2C9_HUMAN CYP2C9 Cytochrome P450 2C9 (CYP2C9 ) P-450MP P450 PB-1 | S-mephenytoin 4-hydroxylase
Type:
Enzyme
Mol. Mass.:
55636.33
Organism:
Homo sapiens (Human)
Description:
P11712
Residue:
490
  
Inhibitor
Name:
BDBM50447472
Synonyms:
CHEMBL3115177
Type:
Small organic molecule
Emp. Form.:
C36H47N7O4S2
Mol. Mass.:
705.933
SMILES:
CC(C)c1nc(CN(C)C(=O)N[C@@H](CCN)C(=O)N[C@H](CC[C@H](Cc2ccccc2)NC(=O)OCc2cncs2)Cc2ccccc2)cs1
: