Target
Bombesin receptor subtype-3
Ligand
BDBM50447483
Substrate
Meas. Tech.
ChEMBL_1288544 (CHEMBL3118977)
EC50
12±n/a nM
Citation
 Matsufuji, TShimada, KKobayashi, SKawamura, AFujimoto, TArita, THara, TKonishi, MAbe-Ohya, RIzumi, MSogawa, YNagai, YYoshida, KTakahashi, H Discovery of novel chiral diazepines as bombesin receptor subtype-3 (BRS-3) agonists with low brain penetration. Bioorg Med Chem Lett 24:750-5 (2014)  
Target
Name:
Bombesin receptor subtype-3
Synonyms:
BRS-3 BRS3_HUMAN Bombesin like receptor 3
Type:
Enzyme Catalytic Domain
Mol. Mass.:
44424.45
Organism:
Homo sapiens (Human)
Description:
Bombesin 3 BRS3 HUMAN::P32247
Residue:
399
  
Inhibitor
Name:
BDBM50447483
Synonyms:
CHEMBL3115382
Type:
Small organic molecule
Emp. Form.:
C24H22F3N3O3
Mol. Mass.:
457.445
SMILES:
OCC1N(CCNc2nc(ccc12)C(F)(F)F)C(=O)Cc1cccc(Oc2ccccc2)c1
: