Target
Cyclin-dependent kinase 4/G1/S-specific cyclin-D1
Ligand
BDBM6860
Substrate
Meas. Tech.
ChEMBL_1289041 (CHEMBL3118105)
IC50
76±n/a nM
Citation
 Reddy, MVAkula, BCosenza, SCAthuluridivakar, SMallireddigari, MRPallela, VRBilla, VKSubbaiah, DRBharathi, EVVasquez-Del Carpio, RPadgaonkar, ABaker, SJReddy, EP Discovery of 8-cyclopentyl-2-[4-(4-methyl-piperazin-1-yl)-phenylamino]-7-oxo-7,8-dihydro-pyrido[2,3-d]pyrimidine-6-carbonitrile (7x) as a potent inhibitor of cyclin-dependent kinase 4 (CDK4) and AMPK-related kinase 5 (ARK5). J Med Chem 57:578-99 (2014)  
Target
Name:
Cyclin-dependent kinase 4/G1/S-specific cyclin-D1
Synonyms:
CDK4/CycD CDK4/Cyclin D1 Cyclin-Dependent Kinase 4 (CDK4) Cyclin-dependent kinase 4/G1/S-specific cyclin D1 | Cyclin-dependent kinase 4/cyclin D1
Type:
Protein Complex
Mol. Mass.:
Description:
CDK4/D1 complexes were purified from insect cells co-infected with baculovirus vectors containing each of the components.
Components:
This complex has 2 components.
Component 1
Name:
Cyclin-dependent kinase 4
Synonyms:
CDK4 Cell division protein kinase 4 PSK-J3
Type:
Enzyme Subunit
Mol. Mass.:
33731.96
Organism:
Homo sapiens (Human)
Description:
P11802
Residue:
303
  
Component 2
Name:
G1/S-specific cyclin-D1
Synonyms:
B-cell lymphoma 1 protein BCL-1 oncogene CCND1 PRAD1 | PRAD1 oncogene
Type:
Enzyme Subunit
Mol. Mass.:
33717.70
Organism:
Homo sapiens (Human)
Description:
Residue:
295
  
Inhibitor
Name:
BDBM6860
Synonyms:
6-bromo-3,13,23-triazahexacyclo[14.7.0.0^{2,10}.0^{4,9}.0^{11,15}.0^{17,22}]tricosa-1(16),2(10),4(9),5,7,11(15),17(22),18,20-nonaene-12,14-dione | Indolocarbazole deriv. 4(d)
Type:
Small Organic Molecule
Emp. Form.:
C20H10BrN3O2
Mol. Mass.:
404.216
SMILES:
Brc1ccc2c(c1)[nH]c1c3[nH]c4ccccc4c3c3C(=O)NC(=O)c3c21
: