Target
Vitamin K-dependent protein C
Ligand
BDBM50447525
Substrate
Meas. Tech.
ChEMBL_1289202 (CHEMBL3119469)
Ki
400±n/a nM
Citation
 Bach, PKnerr, LFjellström, OHansson, KMattsson, CGustafsson, D Design, synthesis, and SAR of a series of activated protein C (APC) inhibitors with selectivity against thrombin for the treatment of haemophilia. Bioorg Med Chem Lett 24:821-7 (2014)  
Target
Name:
Vitamin K-dependent protein C
Synonyms:
Activated protein C cofactor Apolipoprotein H Blood coagulation factor XIV Coagulation factor V heavy chain Endothelial protein C receptor PROC_HUMAN Vitamin K-dependent protein C precursor
Type:
Enzyme
Mol. Mass.:
52067.73
Organism:
Homo sapiens (Human)
Description:
Residue:
461
  
Inhibitor
Name:
BDBM50447525
Synonyms:
CHEMBL3115893
Type:
Small organic molecule
Emp. Form.:
C27H42N6O4
Mol. Mass.:
514.6602
SMILES:
NC(=N)c1ccc(CNC(=O)C(CC2CCNCC2)NC(=O)[C@@H](CC2CCCCC2)NCC(O)=O)cc1
: