Target
Vitamin K-dependent protein C
Ligand
BDBM50193243
Substrate
Meas. Tech.
ChEMBL_1289202 (CHEMBL3119469)
Ki
500±n/a nM
Citation
 Bach, PKnerr, LFjellström, OHansson, KMattsson, CGustafsson, D Design, synthesis, and SAR of a series of activated protein C (APC) inhibitors with selectivity against thrombin for the treatment of haemophilia. Bioorg Med Chem Lett 24:821-7 (2014)  
Target
Name:
Vitamin K-dependent protein C
Synonyms:
Activated protein C cofactor Apolipoprotein H Blood coagulation factor XIV Coagulation factor V heavy chain Endothelial protein C receptor PROC_HUMAN Vitamin K-dependent protein C precursor
Type:
Enzyme
Mol. Mass.:
52067.73
Organism:
Homo sapiens (Human)
Description:
Residue:
461
  
Inhibitor
Name:
BDBM50193243
Synonyms:
({(R)-[2-(4-carbamimidoyl-benzylcarbamoyl)-indan-2-ylcarbamoyl]-cyclohexyl-methyl}-amino)-acetic acid | CHEMBL215295
Type:
Small organic molecule
Emp. Form.:
C28H35N5O4
Mol. Mass.:
505.6086
SMILES:
NC(=N)c1ccc(CNC(=O)C2(Cc3ccccc3C2)NC(=O)[C@H](NCC(O)=O)C2CCCCC2)cc1
: