Target
Vitamin K-dependent protein C
Ligand
BDBM29388
Substrate
Meas. Tech.
ChEMBL_1289213 (CHEMBL3119480)
IC50
1300±n/a nM
Citation
 Bach, PKnerr, LFjellström, OHansson, KMattsson, CGustafsson, D Design, synthesis, and SAR of a series of activated protein C (APC) inhibitors with selectivity against thrombin for the treatment of haemophilia. Bioorg Med Chem Lett 24:821-7 (2014)  
Target
Name:
Vitamin K-dependent protein C
Synonyms:
Activated protein C cofactor Apolipoprotein H Blood coagulation factor XIV Coagulation factor V heavy chain Endothelial protein C receptor PROC_HUMAN Vitamin K-dependent protein C precursor
Type:
Enzyme
Mol. Mass.:
52067.73
Organism:
Homo sapiens (Human)
Description:
Residue:
461
  
Inhibitor
Name:
BDBM29388
Synonyms:
Exanta US11584714, Compound 999
Type:
Small organic molecule
Emp. Form.:
C22H31N5O4
Mol. Mass.:
429.5126
SMILES:
NC(=N)c1ccc(CNC(=O)[C@@H]2CCN2C(=O)[C@H](NCC(O)=O)C2CCCCC2)cc1
: