Target
Vitamin K-dependent protein C
Ligand
BDBM50447524
Substrate
Meas. Tech.
ChEMBL_1289213 (CHEMBL3119480)
IC50
3100±n/a nM
Citation
 Bach, PKnerr, LFjellström, OHansson, KMattsson, CGustafsson, D Design, synthesis, and SAR of a series of activated protein C (APC) inhibitors with selectivity against thrombin for the treatment of haemophilia. Bioorg Med Chem Lett 24:821-7 (2014)  
Target
Name:
Vitamin K-dependent protein C
Synonyms:
Activated protein C cofactor Apolipoprotein H Blood coagulation factor XIV Coagulation factor V heavy chain Endothelial protein C receptor PROC_HUMAN Vitamin K-dependent protein C precursor
Type:
Enzyme
Mol. Mass.:
52067.73
Organism:
Homo sapiens (Human)
Description:
Residue:
461
  
Inhibitor
Name:
BDBM50447524
Synonyms:
CHEMBL3115896
Type:
Small organic molecule
Emp. Form.:
C26H42N6O2
Mol. Mass.:
470.6507
SMILES:
N[C@H](CC1CCCCC1)C(=O)NC(CCC1CCNCC1)C(=O)NCc1ccc(cc1)C(N)=N
: