Target
Fatty-acid amide hydrolase 1 [30-579]
Ligand
BDBM50447747
Substrate
Meas. Tech.
ChEMBL_1290134 (CHEMBL3117474)
IC50
0.170000±n/a nM
Citation
 Kono, MMatsumoto, TImaeda, TKawamura, TFujimoto, SKosugi, YOdani, TShimizu, YMatsui, HShimojo, MKori, M Design, synthesis, and biological evaluation of a series of piperazine ureas as fatty acid amide hydrolase inhibitors. Bioorg Med Chem 22:1468-78 (2014)  
Target
Name:
Fatty-acid amide hydrolase 1 [30-579]
Synonyms:
Anandamide amidohydrolase 1 Faah Fatty Acid Amide Hydrolase Fatty-acid amide hydrolase (FAAH) Fatty-acid amide hydrolase 1 (FAAH) Oleamide hydrolase 1
Type:
Single-pass membrane protein; homodimer
Mol. Mass.:
60474.00
Organism:
Rattus norvegicus (rat)
Description:
P97612 (aa 30-579)
Residue:
550
  
Inhibitor
Name:
BDBM50447747
Synonyms:
CHEMBL3113272
Type:
Small organic molecule
Emp. Form.:
C19H17F2N7O
Mol. Mass.:
397.3814
SMILES:
Fc1ccc(F)c(c1)-c1ccnc(n1)N1CCN(CC1)C(=O)Nc1cccnn1
: