Target
Sodium- and chloride-dependent glycine transporter 1
Ligand
BDBM50447907
Substrate
Meas. Tech.
ChEMBL_1288579 (CHEMBL3119199)
IC50
19±n/a nM
Citation
 Jones, CKSheffler, DJWilliams, RJadhav, SBFelts, ASMorrison, RDNiswender, CMDaniels, JSConn, PJLindsley, CW Novel GlyT1 inhibitor chemotypes by scaffold hopping. Part 1: development of a potent and CNS penetrant [3.1.0]-based lead. Bioorg Med Chem Lett 24:1067-70 (2014)  
Target
Name:
Sodium- and chloride-dependent glycine transporter 1
Synonyms:
GlyT-1 Glycine Transporters (GlyT1c) SC6A9_HUMAN Sodium- and chloride-dependent glycine transporter 1 Sodium- and chloride-dependent glycine transporter 1 (GlyT1c) Solute carrier family 6 member 9
Type:
Enzyme
Mol. Mass.:
78270.54
Organism:
Homo sapiens (Human)
Description:
P48067
Residue:
706
  
Inhibitor
Name:
BDBM50447907
Synonyms:
CHEMBL3114788
Type:
Small organic molecule
Emp. Form.:
C21H25ClN4O3S
Mol. Mass.:
448.966
SMILES:
Cn1cnc(c1)S(=O)(=O)N1C[C@H]2[C@@H](C1)[C@]2(CNC(=O)c1ccccc1Cl)CC1CC1
: