Target
ALK tyrosine kinase receptor
Ligand
BDBM50448048
Substrate
Meas. Tech.
ChEMBL_1289255 (CHEMBL3119707)
IC50
650±n/a nM
Citation
 Tardy, SOrsato, AMologni, LBisson, WHDonadoni, CGambacorti-Passerini, CScapozza, LGueyrard, DGoekjian, PG Synthesis and biological evaluation of benzo[4,5]imidazo[1,2-c]pyrimidine and benzo[4,5]imidazo[1,2-a]pyrazine derivatives as anaplastic lymphoma kinase inhibitors. Bioorg Med Chem 22:1303-12 (2014)  
Target
Name:
ALK tyrosine kinase receptor
Synonyms:
ALK ALK_HUMAN CD_antigen: CD246
Type:
Protein
Mol. Mass.:
176453.10
Organism:
Homo sapiens (Human)
Description:
Q9UM73
Residue:
1620
  
Inhibitor
Name:
BDBM50448048
Synonyms:
CHEMBL3115504
Type:
Small organic molecule
Emp. Form.:
C25H19N3O
Mol. Mass.:
377.4379
SMILES:
COc1ccc(cc1)-c1ccc2nc3cncc(\C=C\c4ccccc4)n3c2c1
: