Target
ALK tyrosine kinase receptor
Ligand
BDBM482158
Substrate
Meas. Tech.
ChEMBL_1289255 (CHEMBL3119707)
IC50
56±n/a nM
Citation
 Tardy, SOrsato, AMologni, LBisson, WHDonadoni, CGambacorti-Passerini, CScapozza, LGueyrard, DGoekjian, PG Synthesis and biological evaluation of benzo[4,5]imidazo[1,2-c]pyrimidine and benzo[4,5]imidazo[1,2-a]pyrazine derivatives as anaplastic lymphoma kinase inhibitors. Bioorg Med Chem 22:1303-12 (2014)  
Target
Name:
ALK tyrosine kinase receptor
Synonyms:
ALK ALK_HUMAN CD_antigen: CD246
Type:
Protein
Mol. Mass.:
176453.10
Organism:
Homo sapiens (Human)
Description:
Q9UM73
Residue:
1620
  
Inhibitor
Name:
BDBM482158
Synonyms:
BDBM50242742 | TAE684
Type:
Emp. Form.:
C30H40ClN7O3S
Mol. Mass.:
614.202
SMILES:
COc1cc(ccc1Nc1ncc(Cl)c(Nc2ccccc2S(=O)(=O)C(C)C)n1)N1CCC(CC1)N1CCN(C)CC1
: