Target
Phosphatidylinositol 4-kinase alpha
Ligand
BDBM50448090
Substrate
Meas. Tech.
ChEMBL_1292924 (CHEMBL3122829)
IC50
2.5±n/a nM
Citation
 Leivers, ALTallant, MShotwell, JBDickerson, SLeivers, MRMcDonald, OBGobel, JCreech, KLStrum, SLMathis, ARogers, SMoore, CBBotyanszki, J Discovery of selective small molecule type III phosphatidylinositol 4-kinase alpha (PI4KIIIa) inhibitors as anti hepatitis C (HCV) agents. J Med Chem 57:2091-106 (2014)  
Target
Name:
Phosphatidylinositol 4-kinase alpha
Synonyms:
PI4-kinase alpha PI4K-alpha PI4KA/PI4KAP2 PIK4 PIK4CA Phosphatidylinositol 4-kinase alpha (PI4KA) | PtdIns-4-kinase alpha
Type:
Protein
Mol. Mass.:
231326.70
Organism:
Homo sapiens (Human)
Description:
P42356
Residue:
2102
  
Inhibitor
Name:
BDBM50448090
Synonyms:
CHEMBL3121318
Type:
Small organic molecule
Emp. Form.:
C26H21N5O4S
Mol. Mass.:
499.541
SMILES:
COc1ncc(cc1NS(=O)(=O)c1ccccc1)-c1ccc2nc(N)n(-c3ccccc3)c(=O)c2c1
: