Target
DNA (cytosine-5)-methyltransferase 3-like
Ligand
BDBM50430056
Substrate
Meas. Tech.
ChEMBL_1294383 (CHEMBL3129168)
IC50
10000±n/a nM
Citation
 Valente, SLiu, YSchnekenburger, MZwergel, CCosconati, SGros, CTardugno, MLabella, DFlorean, CMinden, SHashimoto, HChang, YZhang, XKirsch, GNovellino, EArimondo, PBMiele, EFerretti, EGulino, ADiederich, MCheng, XMai, A Selective non-nucleoside inhibitors of human DNA methyltransferases active in cancer including in cancer stem cells. J Med Chem 57:701-13 (2014)  
Target
Name:
DNA (cytosine-5)-methyltransferase 3-like
Synonyms:
DNM3L_HUMAN | DNMT3L
Type:
PROTEIN
Mol. Mass.:
43578.37
Organism:
Homo sapiens (Human)
Description:
ChEMBL_108147
Residue:
386
  
Inhibitor
Name:
BDBM50430056
Synonyms:
CHEMBL2336409 | SGI-1027
Type:
Small organic molecule
Emp. Form.:
C27H23N7O
Mol. Mass.:
461.5178
SMILES:
Cc1cc(Nc2ccc(NC(=O)c3ccc(Nc4ccnc5ccccc45)cc3)cc2)nc(N)n1
: