Target
Cytochrome P450 2D6
Ligand
BDBM50448496
Substrate
Meas. Tech.
ChEMBL_1294675 (CHEMBL3128631)
EC50
>40000±n/a nM
Citation
 Gentles, RGDing, MBender, JABergstrom, CPGrant-Young, KHewawasam, PHudyma, TMartin, SNickel, ARegueiro-Ren, ATu, YYang, ZYeung, KSZheng, XChao, SSun, JHBeno, BRCamac, DMChang, CHGao, MMorin, PESheriff, STredup, JWan, JWitmer, MRXie, DHanumegowda, UKnipe, JMosure, KSantone, KSParker, DDZhuo, XLemm, JLiu, MPelosi, LRigat, KVoss, SWang, YWang, YKColonno, RJGao, MRoberts, SBGao, QNg, AMeanwell, NAKadow, JF Discovery and preclinical characterization of the cyclopropylindolobenzazepine BMS-791325, a potent allosteric inhibitor of the hepatitis C virus NS5B polymerase. J Med Chem 57:1855-79 (2014)  
Target
Name:
Cytochrome P450 2D6
Synonyms:
CP2D6_HUMAN CYP2DL1 Cytochrome P450 2D6 (CYP2D6) P450-DB1
Type:
Protein
Mol. Mass.:
55774.82
Organism:
Homo sapiens (Human)
Description:
P10635
Residue:
497
  
Inhibitor
Name:
BDBM50448496
Synonyms:
CHEMBL3126835
Type:
Small organic molecule
Emp. Form.:
C36H45N5O5S
Mol. Mass.:
659.838
SMILES:
CCN1CC2CC(C1)N2C(=O)[C@]12C[C@H]1c1cc(OC)ccc1-c1c(C3CCCCC3)c3ccc(cc3n1C2)C(=O)NS(=O)(=O)N(C)C
: