Target
Cytochrome P450 2C9
Ligand
BDBM50448497
Substrate
Meas. Tech.
ChEMBL_1294677 (CHEMBL3128674)
EC50
>40000±n/a nM
Citation
 Gentles, RGDing, MBender, JABergstrom, CPGrant-Young, KHewawasam, PHudyma, TMartin, SNickel, ARegueiro-Ren, ATu, YYang, ZYeung, KSZheng, XChao, SSun, JHBeno, BRCamac, DMChang, CHGao, MMorin, PESheriff, STredup, JWan, JWitmer, MRXie, DHanumegowda, UKnipe, JMosure, KSantone, KSParker, DDZhuo, XLemm, JLiu, MPelosi, LRigat, KVoss, SWang, YWang, YKColonno, RJGao, MRoberts, SBGao, QNg, AMeanwell, NAKadow, JF Discovery and preclinical characterization of the cyclopropylindolobenzazepine BMS-791325, a potent allosteric inhibitor of the hepatitis C virus NS5B polymerase. J Med Chem 57:1855-79 (2014)  
Target
Name:
Cytochrome P450 2C9
Synonyms:
(R)-limonene 6-monooxygenase CP2C9_HUMAN CYP2C9 Cytochrome P450 2C9 (CYP2C9 ) P-450MP P450 PB-1 | S-mephenytoin 4-hydroxylase
Type:
Enzyme
Mol. Mass.:
55636.33
Organism:
Homo sapiens (Human)
Description:
P11712
Residue:
490
  
Inhibitor
Name:
BDBM50448497
Synonyms:
CHEMBL3126834
Type:
Small organic molecule
Emp. Form.:
C35H43N5O5S
Mol. Mass.:
645.811
SMILES:
COc1ccc2-c3c(C4CCCCC4)c4ccc(cc4n3C[C@]3(C[C@H]3c2c1)C(=O)N1C2CC1CN(C)C2)C(=O)NS(=O)(=O)N(C)C
: