Target
Coagulation factor X
Ligand
BDBM50448584
Substrate
Meas. Tech.
ChEMBL_1296330 (CHEMBL3129589)
Ki
880±n/a nM
Citation
 Quan, MLWong, PCWang, CWoerner, FSmallheer, JMBarbera, FABozarth, JMBrown, RLHarpel, MRLuettgen, JMMorin, PEPeterson, TRamamurthy, VRendina, ARRossi, KAWatson, CAWei, AZhang, GSeiffert, DWexler, RR Tetrahydroquinoline derivatives as potent and selective factor XIa inhibitors. J Med Chem 57:955-69 (2014)  
Target
Name:
Coagulation factor X
Synonyms:
Activated coagulation factor X (FXa) Coagulation factor X precursor F10 Factor X heavy chain Factor Xa Stuart-Prower factor
Type:
Enzyme
Mol. Mass.:
54726.60
Organism:
Homo sapiens (Human)
Description:
Residue:
488
  
Inhibitor
Name:
BDBM50448584
Synonyms:
CHEMBL3127490
Type:
Small organic molecule
Emp. Form.:
C35H33N5O4
Mol. Mass.:
587.6676
SMILES:
C[C@@]1(C[C@H](Nc2ccc(cc12)C(N)=N)c1cc(NC(=O)C2CC2)cc(c1)-c1ccc(cc1C(O)=O)C(N)=O)c1ccccc1
: