Target
Stearoyl-CoA desaturase
Ligand
BDBM50448659
Substrate
Meas. Tech.
ChEMBL_1296562 (CHEMBL3130897)
IC50
2.0±n/a nM
Citation
 Yang, SMTang, YRano, TLu, HKuo, GHGaul, MDLi, YHo, GLang, WConway, JGLiang, YLenhard, JMDemarest, KTMurray, WV 4-Bicyclic heteroaryl-piperidine derivatives as potent, orally bioavailable stearoyl-CoA desaturase-1 (SCD1) inhibitors: part 2. Pyridazine-based analogs. Bioorg Med Chem Lett 24:1437-41 (2014)  
Target
Name:
Stearoyl-CoA desaturase
Synonyms:
Acyl-CoA desaturase SCD SCDOS Stearoyl-CoA (SCD1) | Stearoyl-CoA desaturase 1
Type:
Enzyme
Mol. Mass.:
41537.27
Organism:
Homo sapiens (Human)
Description:
O00767
Residue:
359
  
Inhibitor
Name:
BDBM50448659
Synonyms:
CHEMBL3127654
Type:
Small organic molecule
Emp. Form.:
C21H22FN5S
Mol. Mass.:
395.496
SMILES:
Cc1csc(n1)-c1ccc(nn1)N1CCC(CC1)N1CCc2ccc(F)cc12
: