Target
ALK tyrosine kinase receptor
Ligand
BDBM50306682
Substrate
Meas. Tech.
ChEMBL_1294716 (CHEMBL3128713)
IC50
80±n/a nM
Citation
 Huang, QJohnson, TWBailey, SBrooun, ABunker, KDBurke, BJCollins, MRCook, ASCui, JJDack, KNDeal, JGDeng, YLDinh, DEngstrom, LDHe, MHoffman, JHoffman, RLJohnson, PSKania, RSLam, HLam, JLLe, PTLi, QLingardo, LLiu, WLu, MWMcTigue, MPalmer, CLRichardson, PFSach, NWShen, HSmeal, TSmith, GLStewart, AETimofeevski, STsaparikos, KWang, HZhu, HZhu, JZou, HYEdwards, MP Design of potent and selective inhibitors to overcome clinical anaplastic lymphoma kinase mutations resistant to crizotinib. J Med Chem 57:1170-87 (2014)  
Target
Name:
ALK tyrosine kinase receptor
Synonyms:
ALK ALK_HUMAN CD_antigen: CD246
Type:
Protein
Mol. Mass.:
176453.10
Organism:
Homo sapiens (Human)
Description:
Q9UM73
Residue:
1620
  
Inhibitor
Name:
BDBM50306682
Synonyms:
(R)-3-(1-(2,6-dichloro-3-fluorophenyl)ethoxy)-5-(1-(piperidin-4-yl)-1H-pyrazol-4-yl)pyridin-2-amine 3-[(1R)-1-(2,6-dichloro-3-fluorophenyl)ethoxy]-5-(1-piperidin-4-yl-1H-pyrazol-4-yl)pyridin-2-amine CRIZOTINIB US10370379, Crizotinib US10780082, Compound Crizotinib US11517561, Compound Crizotinib US9199944, Crizotinib | US9226923, Crizotinib
Type:
Small organic molecule
Emp. Form.:
C21H22Cl2FN5O
Mol. Mass.:
450.337
SMILES:
C[C@@H](Oc1cc(cnc1N)-c1cnn(c1)C1CCNCC1)c1c(Cl)ccc(F)c1Cl
: