Target
Aldehyde dehydrogenase 1A1
Ligand
BDBM47880
Substrate
Meas. Tech.
ChEMBL_1295319 (CHEMBL3130567)
IC50
50±n/a nM
Citation
 Kimble-Hill, ACParajuli, BChen, CHMochly-Rosen, DHurley, TD Development of selective inhibitors for aldehyde dehydrogenases based on substituted indole-2,3-diones. J Med Chem 57:714-22 (2014)  
Target
Name:
Aldehyde dehydrogenase 1A1
Synonyms:
AL1A1_HUMAN ALDH-E1 ALDH1A1 Aldehyde dehydrogenase 1A1 (ALDH1A1) Aldehyde dehydrogenase family 1 member A1 (ALDH1A1) PUMB1 RalDH1 | Retinal dehydrogenase 1
Type:
Protein
Mol. Mass.:
54862.21
Organism:
Homo sapiens (Human)
Description:
Residue:
501
  
Inhibitor
Name:
BDBM47880
Synonyms:
1-(3-phenylpropyl)indole-2,3-dione MLS001183545 cid_2282752
Type:
Small organic molecule
Emp. Form.:
C17H15NO2
Mol. Mass.:
265.3065
SMILES:
O=C1N(CCCc2ccccc2)c2ccccc2C1=O
: