Target
Aldehyde dehydrogenase 1A1
Ligand
BDBM50448790
Substrate
Meas. Tech.
ChEMBL_1295319 (CHEMBL3130567)
IC50
720±n/a nM
Citation
 Kimble-Hill, ACParajuli, BChen, CHMochly-Rosen, DHurley, TD Development of selective inhibitors for aldehyde dehydrogenases based on substituted indole-2,3-diones. J Med Chem 57:714-22 (2014)  
Target
Name:
Aldehyde dehydrogenase 1A1
Synonyms:
AL1A1_HUMAN ALDH-E1 ALDH1A1 Aldehyde dehydrogenase 1A1 (ALDH1A1) Aldehyde dehydrogenase family 1 member A1 (ALDH1A1) PUMB1 RalDH1 | Retinal dehydrogenase 1
Type:
Protein
Mol. Mass.:
54862.21
Organism:
Homo sapiens (Human)
Description:
Residue:
501
  
Inhibitor
Name:
BDBM50448790
Synonyms:
CHEMBL3128208
Type:
Small organic molecule
Emp. Form.:
C9H6BrNO2
Mol. Mass.:
240.053
SMILES:
Cc1cc2C(=O)C(=O)Nc2c(Br)c1
: