Target
Nitric oxide synthase, inducible
Ligand
BDBM50330882
Substrate
Meas. Tech.
ChEMBL_1298289 (CHEMBL3130554)
Ki
4100±n/a nM
Citation
 Cinelli, MALi, HChreifi, GMartásek, PRoman, LJPoulos, TLSilverman, RB Simplified 2-aminoquinoline-based scaffold for potent and selective neuronal nitric oxide synthase inhibition. J Med Chem 57:1513-30 (2014)  
Target
Name:
Nitric oxide synthase, inducible
Synonyms:
Inducible NO synthase Inducible nitric oxide synthase (iNOS) MAC-NOS NOS type II Nitric Oxide Synthase, inducible Nos2
Type:
Enzyme
Mol. Mass.:
130595.79
Organism:
Mus musculus (mouse)
Description:
Recombinant enzyme overexpressed in E. coli.
Residue:
1144
  
Inhibitor
Name:
BDBM50330882
Synonyms:
CHEMBL1277951 N1-((3R,4R)-4-((6-aminopyridin-2-yl)methyl)pyrrolidin-3-yl)-N2-(4-fluorobenzyl)ethane-1,2-diamine tetrahydrochloride US9212144, 1 | US9783500, Compound 2
Type:
Small organic molecule
Emp. Form.:
C21H30FN5
Mol. Mass.:
371.4948
SMILES:
Cc1cc(N)nc(C[C@@H]2CNC[C@@H]2NCCNCCc2cccc(F)c2)c1
: