Target
Neuropeptide Y receptor type 5
Ligand
BDBM50449324
Substrate
Meas. Tech.
ChEMBL_1296657 (CHEMBL3131566)
Ki
8.0±n/a nM
Citation
 Burns, JFChen, BChen, CADoller, DEdelmenky, EJiang, YPeterson, JMSabio, MWeiss, JWhite, ADWu, LBhardwaj, RChandrasena, GBoyle, NJHuang, X cis-1-Oxo-heterocyclyl-4-amido cyclohexane derivatives as NPY5 receptor antagonists. Bioorg Med Chem Lett 24:1458-61 (2014)  
Target
Name:
Neuropeptide Y receptor type 5
Synonyms:
NPY-Y5 NPY5-R NPY5R_HUMAN NPYY5 Neuropeptide Y receptor type 5 ( NPY Y5) | Y5 receptor
Type:
Enzyme
Mol. Mass.:
50746.64
Organism:
Homo sapiens (Human)
Description:
Q15761
Residue:
445
  
Inhibitor
Name:
BDBM50449324
Synonyms:
CHEMBL3126042
Type:
Small organic molecule
Emp. Form.:
C21H21F2N3O3
Mol. Mass.:
401.4065
SMILES:
Fc1cc(F)cc(c1)-c1ccc(NC(=O)[C@@H]2CC[C@@H](CC2)N2CCOC2=O)nc1
: