Target
D(1A) dopamine receptor
Ligand
BDBM50409503
Substrate
Meas. Tech.
ChEMBL_58818 (CHEMBL857791)
Ki
1349±n/a nM
Citation
 Cortizo, LSantana, LRavina, EOrallo, FFontenla, JACastro, ECalleja, JMde Ceballos, ML Synthesis and antidopaminergic activity of some 3-(aminomethyl)tetralones as analogues of butyrophenone. J Med Chem 34:2242-7 (1991)  
Target
Name:
D(1A) dopamine receptor
Synonyms:
DOPAMINE D1 Dopamine D1 high Dopamine receptor Dopamine1-like Drd1a
Type:
Enzyme Catalytic Domain
Mol. Mass.:
49429.75
Organism:
RAT
Description:
P18901
Residue:
446
  
Inhibitor
Name:
BDBM50409503
Synonyms:
CHEMBL310153
Type:
Small organic molecule
Emp. Form.:
C22H26N2O2
Mol. Mass.:
350.454
SMILES:
COc1ccccc1N1CCN(CC2CC(=O)c3ccccc3C2)CC1
: