Target
D(2) dopamine receptor
Ligand
BDBM50409493
Substrate
Meas. Tech.
ChEMBL_60948 (CHEMBL670968)
Ki
25±n/a nM
Citation
 Cortizo, LSantana, LRavina, EOrallo, FFontenla, JACastro, ECalleja, JMde Ceballos, ML Synthesis and antidopaminergic activity of some 3-(aminomethyl)tetralones as analogues of butyrophenone. J Med Chem 34:2242-7 (1991)  
Target
Name:
D(2) dopamine receptor
Synonyms:
DOPAMINE D2 DOPAMINE D2 Short Dopamine D2 receptor Drd2
Type:
G Protein-Coupled Receptor (GPCR)
Mol. Mass.:
50931.60
Organism:
Rattus norvegicus (rat)
Description:
P61169
Residue:
444
  
Inhibitor
Name:
BDBM50409493
Synonyms:
CHEMBL310734
Type:
Small organic molecule
Emp. Form.:
C25H29FN2O2
Mol. Mass.:
408.5084
SMILES:
Fc1ccc(cc1)C(=O)CCCN1CCN(CC2CC(=O)c3ccccc3C2)CC1
: