Target
Glycogen phosphorylase, muscle form
Ligand
BDBM50057754
Substrate
Meas. Tech.
ChEMBL_70989 (CHEMBL680567)
Ki
3020±n/a nM
Citation
 Pastor, MCruciani, GWatson, KA A strategy for the incorporation of water molecules present in a ligand binding site into a three-dimensional quantitative structure--activity relationship analysis. J Med Chem 40:4089-102 (1998)  
Target
Name:
Glycogen phosphorylase, muscle form
Synonyms:
Glycogen phosphorylase, muscle form Myophosphorylase PYGM_HUMAN
Type:
PROTEIN
Mol. Mass.:
97097.45
Organism:
Homo sapiens (Human)
Description:
ChEMBL_1449751
Residue:
842
  
Inhibitor
Name:
BDBM50057754
Synonyms:
8,9,10-Trihydroxy-7-hydroxymethyl-6-oxa-1,3-diaza-spiro[4.5]decane-2,4-dione | CHEMBL287432
Type:
Small organic molecule
Emp. Form.:
C8H12N2O7
Mol. Mass.:
248.1901
SMILES:
OCC1OC2(NC(=O)NC2=O)C(O)C(O)C1O
: