Target
Glycogen phosphorylase, muscle form
Ligand
BDBM50057751
Substrate
Meas. Tech.
ChEMBL_70989 (CHEMBL680567)
Ki
2570396±n/a nM
Citation
 Pastor, MCruciani, GWatson, KA A strategy for the incorporation of water molecules present in a ligand binding site into a three-dimensional quantitative structure--activity relationship analysis. J Med Chem 40:4089-102 (1998)  
Target
Name:
Glycogen phosphorylase, muscle form
Synonyms:
Glycogen phosphorylase, muscle form Myophosphorylase PYGM_HUMAN
Type:
PROTEIN
Mol. Mass.:
97097.45
Organism:
Homo sapiens (Human)
Description:
ChEMBL_1449751
Residue:
842
  
Inhibitor
Name:
BDBM50057751
Synonyms:
3,4,5-Trihydroxy-6-hydroxymethyl-tetrahydro-pyran-2-carboxylic acid (2-hydroxy-ethyl)-amide | CHEMBL286575
Type:
Small organic molecule
Emp. Form.:
C9H17NO7
Mol. Mass.:
251.2338
SMILES:
OCCNC(=O)C1OC(CO)C(O)C(O)C1O
: