Target
Glycogen phosphorylase, muscle form
Ligand
BDBM50240802
Substrate
Meas. Tech.
ChEMBL_70989 (CHEMBL680567)
Ki
31623±n/a nM
Citation
 Pastor, MCruciani, GWatson, KA A strategy for the incorporation of water molecules present in a ligand binding site into a three-dimensional quantitative structure--activity relationship analysis. J Med Chem 40:4089-102 (1998)  
Target
Name:
Glycogen phosphorylase, muscle form
Synonyms:
Glycogen phosphorylase, muscle form Myophosphorylase PYGM_HUMAN
Type:
PROTEIN
Mol. Mass.:
97097.45
Organism:
Homo sapiens (Human)
Description:
ChEMBL_1449751
Residue:
842
  
Inhibitor
Name:
BDBM50240802
Synonyms:
1-N-ACETYL-BETA-D-GLUCOSAMINE N-((2R,3R,4S,5S,6R)-3,4,5-trihydroxy-6-(hydroxymethyl)tetrahydro-2H-pyran-2-yl)acetamide N-acetyl-b-D-glucopyranosylamine | N-acetyl-beta-D-glucopyranosylamine
Type:
Small organic molecule
Emp. Form.:
C8H15NO6
Mol. Mass.:
221.2078
SMILES:
CC(=O)N[C@@H]1O[C@H](CO)[C@@H](O)[C@H](O)[C@H]1O
: