Target
Adenosine receptor A3
Ligand
BDBM50049398
Substrate
Meas. Tech.
ChEMBL_30324 (CHEMBL638578)
Ki
3388±n/a nM
Citation
 Moro, Svan Rhee, AMSanders, LHJacobson, KA Flavonoid derivatives as adenosine receptor antagonists: a comparison of the hypothetical receptor binding site based on a comparative molecular field analysis model. J Med Chem 41:46-52 (1998)  
Target
Name:
Adenosine receptor A3
Synonyms:
A3 adenosine receptor (hA3) ADORA3 | Adenosine A3 receptor (A3AR)
Type:
G Protein-Coupled Receptor (GPCR)
Mol. Mass.:
36197.32
Organism:
Homo sapiens (Human)
Description:
P0DMS8
Residue:
318
  
Inhibitor
Name:
BDBM50049398
Synonyms:
3,5,7-Trimethoxy-2-(4-methoxy-phenyl)-chromen-4-one | CHEMBL356036
Type:
Small organic molecule
Emp. Form.:
C19H18O6
Mol. Mass.:
342.3426
SMILES:
COc1ccc(cc1)-c1oc2cc(OC)cc(OC)c2c(=O)c1OC
: