Target
Gag-Pol polyprotein [489-587]
Ligand
BDBM50000751
Substrate
Meas. Tech.
ChEMBL_158036 (CHEMBL768260)
Ki
0.24±n/a nM
Citation
 Doweyko, AM Three-dimensional pharmacophores from binding data. J Med Chem 37:1769-78 (1994)  
Target
Name:
Gag-Pol polyprotein [489-587]
Synonyms:
Human immunodeficiency virus type 1 protease Pol polyprotein | gag-pol
Type:
Enzyme Subunit
Mol. Mass.:
10781.16
Organism:
Human immunodeficiency virus type 1
Description:
P04585[489-587]
Residue:
99
  
Inhibitor
Name:
BDBM50000751
Synonyms:
CHEMBL300050
Type:
Small organic molecule
Emp. Form.:
C42H68N8O11
Mol. Mass.:
861.0363
SMILES:
CC[C@H](C)[C@H](NC(=O)[C@H]1CCCN1C[C@H](O)[C@H](Cc1ccccc1)NC(=O)[C@H](CC(N)=O)NC(=O)[C@H](CC(C)C)NC(=O)[C@H](CO)NC(C)=O)C(=O)N[C@@H](C(C)C)C(=O)OC
: