Target
Gag-Pol polyprotein [489-587]
Ligand
BDBM50000755
Substrate
Meas. Tech.
ChEMBL_158036 (CHEMBL768260)
Ki
63±n/a nM
Citation
 Doweyko, AM Three-dimensional pharmacophores from binding data. J Med Chem 37:1769-78 (1994)  
Target
Name:
Gag-Pol polyprotein [489-587]
Synonyms:
Human immunodeficiency virus type 1 protease Pol polyprotein | gag-pol
Type:
Enzyme Subunit
Mol. Mass.:
10781.16
Organism:
Human immunodeficiency virus type 1
Description:
P04585[489-587]
Residue:
99
  
Inhibitor
Name:
BDBM50000755
Synonyms:
CHEMBL299667
Type:
Small organic molecule
Emp. Form.:
C30H39N3O9
Mol. Mass.:
585.6454
SMILES:
CC(C)(C)OC(=O)N[C@@H](Cc1ccccc1)[C@@H](O)CC(=O)N[C@@H](CCC(O)=O)C(=O)N[C@@H](Cc1ccccc1)C(O)=O
: