Target
Delta-type opioid receptor
Ligand
BDBM50002068
Substrate
Meas. Tech.
ChEMBL_304038 (CHEMBL840216)
Ki
2±n/a nM
Citation
 Peng, YKeenan, SMZhang, QKholodovych, VWelsh, WJ 3D-QSAR comparative molecular field analysis on opioid receptor antagonists: pooling data from different studies. J Med Chem 48:1620-9 (2005)  
Target
Name:
Delta-type opioid receptor
Synonyms:
Cytochrome P450 3A4 Delta opioid receptor Delta-type opioid receptor (DOR) OPRD_RAT Opioid receptor Opioid receptors; mu & delta Ror-a | Voltage-gated potassium channel
Type:
G Protein-Coupled Receptor (GPCR)
Mol. Mass.:
40465.04
Organism:
Rattus norvegicus (rat)
Description:
Competition binding assays were using CHO-K1 cell membranes expressing the opioid receptor.
Residue:
372
  
Inhibitor
Name:
BDBM50002068
Synonyms:
CHEMBL606740
Type:
Small organic molecule
Emp. Form.:
C25H26N2O3
Mol. Mass.:
402.4855
SMILES:
[H][C@]12Oc3c4c(C[C@@]5([H])N(CCC)CC[C@@]14[C@@]5(O)Cc1c2[nH]c2ccccc12)ccc3O
: