Target
Mu-type opioid receptor
Ligand
BDBM50001975
Substrate
Meas. Tech.
ChEMBL_304036 (CHEMBL840214)
Ki
195±n/a nM
Citation
 Peng, YKeenan, SMZhang, QKholodovych, VWelsh, WJ 3D-QSAR comparative molecular field analysis on opioid receptor antagonists: pooling data from different studies. J Med Chem 48:1620-9 (2005)  
Target
Name:
Mu-type opioid receptor
Synonyms:
MOR-1 Mu-type opioid receptor (MOR) OPRM_RAT Opioid receptor B Ror-b
Type:
G Protein-Coupled Receptor (GPCR)
Mol. Mass.:
44503.11
Organism:
Rattus norvegicus (rat)
Description:
Competition binding assays were carried out using membrane preparations from transfected HN9.10 cells that constitutively expressed the mu opioid receptor.
Residue:
398
  
Inhibitor
Name:
BDBM50001975
Synonyms:
CHEMBL193586
Type:
Small organic molecule
Emp. Form.:
C26H23BrN2O3
Mol. Mass.:
491.376
SMILES:
[H][C@@]12Oc3c4c(CC5N(C)CCC14[C@@]5(O)Cc1cc(cnc21)-c1ccc(Br)cc1)ccc3O
: