Target
Histone deacetylase
Ligand
BDBM19149
Substrate
Meas. Tech.
ChEMBL_422128 (CHEMBL908249)
IC50
26.5±n/a nM
Citation
 Mai, ARotili, DMassa, SBrosch, GSimonetti, GPassariello, CPalamara, AT Discovery of uracil-based histone deacetylase inhibitors able to reduce acquired antifungal resistance and trailing growth in Candida albicans. Bioorg Med Chem Lett 17:1221-5 (2007)  
Target
Name:
Histone deacetylase
Synonyms:
Histone deacetylase HD1B
Type:
PROTEIN
Mol. Mass.:
50930.01
Organism:
Zea mays
Description:
ChEMBL_422128
Residue:
458
  
Inhibitor
Name:
BDBM19149
Synonyms:
CHEMBL98 SAHA US10188756, Compound SAHA US11505523, Compound SAHA US9353061, SAHA US9695181, Vorinostat Zolinza suberoylanilide hydroxamic acid
Type:
Small organic molecule
Emp. Form.:
C14H20N2O3
Mol. Mass.:
264.3202
SMILES:
ONC(=O)CCCCCCC(=O)Nc1ccccc1
: