Target
Acetylcholinesterase
Ligand
BDBM10404
Substrate
Meas. Tech.
ChEMBL_901574 (CHEMBL3068555)
IC50
500±n/a nM
Citation
  TBA Med Chem Res 21:2329-2339 (2012)    Article 
Target
Name:
Acetylcholinesterase
Synonyms:
ACES_ELEEL Acetylcholinesterase (EeAChE) | ache
Type:
Enzyme
Mol. Mass.:
71812.79
Organism:
Electrophorus electricus (Electric eel)
Description:
Residue:
633
  
Inhibitor
Name:
BDBM10404
Synonyms:
(1S,12S,14R)-9-methoxy-4-methyl-11-oxa-4-azatetracyclo[8.6.1.0^{1,12}.0^{6,17}]heptadeca-6,8,10(17),15-tetraen-14-ol GALANTAMINE HYDROBROMIDE Galanthamine Lycoremine Nivaline Reminyl US9586925, Galantamine | galantamine
Type:
Small organic molecule
Emp. Form.:
C17H21NO3
Mol. Mass.:
287.3535
SMILES:
COc1ccc2CN(C)CC[C@@]34C=C[C@H](O)C[C@@H]3Oc1c24
: