Target
Peroxisome proliferator-activated receptor gamma
Ligand
BDBM50004755
Substrate
Meas. Tech.
ChEMBL_922064 (CHEMBL3077606)
EC50
1.00±n/a nM
Citation
  TBA Med Chem Res 22:287-302 (2013)    Article 
Target
Name:
Peroxisome proliferator-activated receptor gamma
Synonyms:
NR1C3 PPAR-gamma PPARG_HUMAN Peroxisome proliferator-activated receptor gamma (PPAR gamma) Peroxisome proliferator-activated receptor gamma (PPARĪ³) peroxisome proliferator-activated receptor gamma isoform 2
Type:
Nuclear Receptor
Mol. Mass.:
57613.46
Organism:
Homo sapiens (Human)
Description:
P37231
Residue:
505
  
Inhibitor
Name:
BDBM50004755
Synonyms:
CHEMBL2237300
Type:
Small organic molecule
Emp. Form.:
C27H31NO5
Mol. Mass.:
449.5387
SMILES:
Cc1oc(nc1CCOc1ccc(C[C@H](Oc2ccccc2)C(O)=O)cc1)C1CCCCC1
: