Target
Peroxisome proliferator-activated receptor gamma
Ligand
BDBM50122340
Substrate
Meas. Tech.
ChEMBL_922064 (CHEMBL3077606)
EC50
2700±n/a nM
Citation
  TBA Med Chem Res 22:287-302 (2013)    Article 
Target
Name:
Peroxisome proliferator-activated receptor gamma
Synonyms:
NR1C3 PPAR-gamma PPARG_HUMAN Peroxisome proliferator-activated receptor gamma (PPAR gamma) Peroxisome proliferator-activated receptor gamma (PPARĪ³) peroxisome proliferator-activated receptor gamma isoform 2
Type:
Nuclear Receptor
Mol. Mass.:
57613.46
Organism:
Homo sapiens (Human)
Description:
P37231
Residue:
505
  
Inhibitor
Name:
BDBM50122340
Synonyms:
(S)-3-[4-(3,3-Diphenyl-allyloxy)-phenyl]-2-ethoxy-propionic acid | CHEMBL314483
Type:
Small organic molecule
Emp. Form.:
C26H26O4
Mol. Mass.:
402.4822
SMILES:
[#6]-[#6]-[#8]-[#6@@H](-[#6]-c1ccc(-[#8]-[#6]\[#6]=[#6](/c2ccccc2)-c2ccccc2)cc1)-[#6](-[#8])=O
: