Target
Peroxisome proliferator-activated receptor gamma
Ligand
BDBM50122342
Substrate
Meas. Tech.
ChEMBL_922064 (CHEMBL3077606)
EC50
4000±n/a nM
Citation
  TBA Med Chem Res 22:287-302 (2013)    Article 
Target
Name:
Peroxisome proliferator-activated receptor gamma
Synonyms:
NR1C3 PPAR-gamma PPARG_HUMAN Peroxisome proliferator-activated receptor gamma (PPAR gamma) Peroxisome proliferator-activated receptor gamma (PPARĪ³) peroxisome proliferator-activated receptor gamma isoform 2
Type:
Nuclear Receptor
Mol. Mass.:
57613.46
Organism:
Homo sapiens (Human)
Description:
P37231
Residue:
505
  
Inhibitor
Name:
BDBM50122342
Synonyms:
(S)-2-Ethoxy-3-{4-[(Z)-3-(4-fluoro-phenyl)-3-phenyl-allyloxy]-phenyl}-propionic acid | CHEMBL315048
Type:
Small organic molecule
Emp. Form.:
C26H25FO4
Mol. Mass.:
420.4727
SMILES:
CCO[C@@H](Cc1ccc(OC\C=C(\c2ccccc2)c2ccc(F)cc2)cc1)C(O)=O
: