Target
Alpha-1A adrenergic receptor
Ligand
BDBM50392637
Substrate
Meas. Tech.
ChEMBL_936573 (CHEMBL2318736)
Ki
0.41±n/a nM
Citation
 Bonifazi, APiergentili, ADel Bello, FFarande, YGiannella, MPigini, MAmantini, CNabissi, MFarfariello, VSantoni, GPoggesi, ELeonardi, AMenegon, SQuaglia, W Structure-activity relationships in 1,4-benzodioxan-related compounds. 11. (1) reversed enantioselectivity of 1,4-dioxane derivatives ina1-adrenergic and 5-HT1A receptor binding sites recognition. J Med Chem 56:584-8 (2013)  
Target
Name:
Alpha-1A adrenergic receptor
Synonyms:
ADA1A_HUMAN ADRA1C Alpha 1A-adrenoceptor Alpha adrenergic receptor 1a Alpha-adrenergic receptor 1c adrenergic Alpha1 | adrenergic Alpha1C
Type:
Cell-surface receptors
Mol. Mass.:
51511.67
Organism:
Homo sapiens (Human)
Description:
P35348
Residue:
466
  
Inhibitor
Name:
BDBM50392637
Synonyms:
CHEMBL215421
Type:
Small organic molecule
Emp. Form.:
C19H23NO5
Mol. Mass.:
345.3896
SMILES:
COc1cccc(OC)c1OCCNC[C@H]1COc2ccccc2O1
: