Target
Carbonic anhydrase 1
Ligand
BDBM50005003
Substrate
Meas. Tech.
ChEMBL_965226 (CHEMBL2394011)
IC50
198±n/a nM
Citation
 Wang, LYang, CLu, WLiu, LGao, RLiao, SZhao, ZZhu, LXu, YLi, HHuang, JZhu, W Discovery of new potent inhibitors for carbonic anhydrase IX by structure-based virtual screening. Bioorg Med Chem Lett 23:3496-9 (2013)  
Target
Name:
Carbonic anhydrase 1
Synonyms:
CA-I CAB Carbonate dehydratase I Carbonic anhydrase 1 (CA I) Carbonic anhydrase 1 (Recombinant CA I) Carbonic anhydrase B Carbonic anhydrase I (CA I) Carbonic anhydrase I (CAI) Carbonic anhydrase isoenzyme I (hCA I) | hCA
Type:
Enzyme
Mol. Mass.:
28873.37
Organism:
Homo sapiens (Human)
Description:
P00915
Residue:
261
  
Inhibitor
Name:
BDBM50005003
Synonyms:
CHEMBL2392423
Type:
Small organic molecule
Emp. Form.:
C14H13N3O3S2
Mol. Mass.:
335.401
SMILES:
NS(=O)(=O)c1ccc(NC(=S)NC(=O)c2ccccc2)cc1
: