Target
Indolethylamine N-methyltransferase
Ligand
BDBM50000118
Substrate
Meas. Tech.
ChEMBL_1333667 (CHEMBL3231053)
IC50
7100±n/a nM
Citation
 Rokach, JHamel, PHunter, NRReader, GRooney, CSAnderson, PSCragoe, EJMandel, LR Cyclic amidine inhibitors of indolamine N-methyltransferase. J Med Chem 22:237-47 (1979)  
Target
Name:
Indolethylamine N-methyltransferase
Synonyms:
Amine N-methyltransferase Arylamine N-methyltransferase INMT_RABIT Thioether S-methyltransferase
Type:
PROTEIN
Mol. Mass.:
28949.17
Organism:
Oryctolagus cuniculus
Description:
ChEMBL_108264
Residue:
263
  
Inhibitor
Name:
BDBM50000118
Synonyms:
CHEMBL3228357
Type:
Small organic molecule
Emp. Form.:
C6H11BrN2S
Mol. Mass.:
223.134
SMILES:
Br.C=CCN1CCSC1=N
: