Target
Indolethylamine N-methyltransferase
Ligand
BDBM50000170
Substrate
Meas. Tech.
ChEMBL_1333667 (CHEMBL3231053)
IC50
7000±n/a nM
Citation
 Rokach, JHamel, PHunter, NRReader, GRooney, CSAnderson, PSCragoe, EJMandel, LR Cyclic amidine inhibitors of indolamine N-methyltransferase. J Med Chem 22:237-47 (1979)  
Target
Name:
Indolethylamine N-methyltransferase
Synonyms:
Amine N-methyltransferase Arylamine N-methyltransferase INMT_RABIT Thioether S-methyltransferase
Type:
PROTEIN
Mol. Mass.:
28949.17
Organism:
Oryctolagus cuniculus
Description:
ChEMBL_108264
Residue:
263
  
Inhibitor
Name:
BDBM50000170
Synonyms:
CHEMBL3228326
Type:
Small organic molecule
Emp. Form.:
C12H18N2O4
Mol. Mass.:
254.2823
SMILES:
OC(=O)\C=C\C(O)=O.CC1CN2CCCN=C2C1
: